{"text_format":"1","workbook":"xlsx","n_sheets":2,"sheets":["RENUUO АОСР","ACT LOG"],"not_rendered":{"charts":0,"images":0,"macros":1,"external_links":0,"defined_names":2,"comments":0,"pivot_tables":0},"unopened":[],"bounds":{"document_bytes":16777216,"sheet_cells":100000,"rows_first":2000,"rows_last":500,"rows_between":2000,"halvings":0,"cell_chars":16384,"cell_head_chars":4096},"cells_cut":0,"cells_raw":0,"read":"whole","date_system":"1900"}

{"sheet":"RENUUO АОСР","index":0,"n_rows":80,"n_cols":37,"rows_kept":80,"cut":false,"hidden":false,"merged":[[77,3,77,14],[80,3,80,14],[71,3,71,14],[73,3,73,14],[74,3,74,14],[76,3,76,14],[72,12,72,14],[75,12,75,14],[78,12,78,14],[79,3,79,14],[53,3,53,14],[69,16,69,21],[70,3,70,14],[57,3,57,14],[58,3,58,14],[62,3,62,14],[64,3,64,14],[63,12,63,14],[66,12,66,14],[69,12,69,14],[65,3,65,14],[67,3,67,14],[68,3,68,14],[59,3,59,14],[23,3,23,14],[24,3,24,14],[11,3,11,14],[0,3,0,14],[1,3,1,14],[2,3,2,14],[3,3,3,14],[4,3,4,14],[5,3,5,14],[6,3,6,14],[7,3,7,14],[8,3,8,14],[9,3,9,14],[10,3,10,14],[18,12,18,14],[20,3,20,14],[21,3,21,14],[22,3,22,14],[12,3,12,14],[13,3,13,14],[14,3,14,14],[15,3,15,14],[16,3,16,14],[18,3,18,7],[25,3,25,14],[26,3,26,14],[27,3,27,14],[28,3,28,14],[29,3,29,14],[30,3,30,14],[31,3,31,14],[32,3,32,14],[33,3,33,14],[34,3,34,14],[36,3,36,14],[48,3,48,14],[39,3,39,14],[40,3,40,14],[41,3,41,14],[42,3,42,14],[44,3,44,14],[45,3,45,14],[46,3,46,14],[47,3,47,14],[38,7,38,14],[49,3,49,14],[51,3,51,14],[52,3,52,14],[37,3,37,6],[37,7,37,14]]}
[null,null,null,"Объект капитального строительства:"]
["ZONE",{"$f":"IFERROR((VLOOKUP(Q2,'ACT LOG'!B2:E64970,4,0)),\"\")","v":8},null,{"$f":"\"«Комплекс по производству поливинилхлорида (ПВХ) мощностью 330 тыс. т/год». 607650, Нижегородская обл., Кстовский район, г. Кстово, промзона. Зона \"&B2&\". Сеть дождевой канализации (CWU/WWGU/WWTU). Титул 930-7.\"","v":"«Комплекс по производству поливинилхлорида (ПВХ) мощностью 330 тыс. т/год». 607650, Нижегородская обл., Кстовский район, г. Кстово, промзона. Зона 8. Сеть дождевой канализации (CWU/WWGU/WWTU). Титул 930-7."},null,null,null,null,null,null,null,null,null,null,null,null,28,null,"ctrl + R to print by 2 copies"]
["ACT SEQ",{"$f":"VLOOKUP(Q2,'ACT LOG'!B:F,5,0)","v":"DOP-1"},null,"(наименование,  почтовый  или  строительный  адрес  объекта  капитального строительства)"]
["ACT NO",{"$f":"\"№RENUUO-1410-ZONE\"&B2&\"-\"&B3","v":"№RENUUO-1410-ZONE8-DOP-1"},null,"Застройщик или заказчик:"]
["ACT DATE",{"$f":"VLOOKUP(Q2,'ACT LOG'!B:G,6,0)","v":41548},null,"ООО «РусВинил», Свидетельство о гос. регистрации серия 52 №003606845 от 11.10.2007 г., ОГРН 1075262019766, ИНН 5262218620, 607650, Нижегородская область,  Кстовский район, г. Кстово, промзона, тел. +7 831 463 69 00, Факс: + 7 831 463 69 01",null,null,null,null,null,null,null,null,null,null,null,null,null,null,null,null,null,null,null,null,"представитель заказчика"]
[null,null,null,"(наименование, номер и дата выдачи свидетельства о государственной регистрации, ОГРН, ИНН, почтовые реквизиты, телефон/факс - для юридических лиц)",null,null,null,null,null,null,null,null,null,null,null,null,null,null,null,null,null,null,null,"действующая комиссия"]
[null,null,null,"Лицо, осуществляющее строительство:",null,null,null,null,null,null,null,null,null,null,null,null,null,null,null,null,null,null,null,"Зон.","Должность","Ф.И.О.","Приказ",null,null,null,null,null,null,"старые"]
[null,null,null,"ЗАО «Ренейссанс Констракшн». Свидетельство о гос. регистрации серия 77 №00540119 от 15.10.2002 г., ОГРН 1027739384309, ИНН 7708185129, 107078, г. Москва, Орликов переулок, д. 6, тел. +7(495)787-59-20, факс +7(495)365-366.",null,null,null,null,null,null,null,null,null,null,null,null,null,null,null,null,null,null,null,1,"инженер по взаимодействию с подрядными организациями ООО \"РусВинил\"","Дульцева Т.А.","приказ №206-ОС от 09.11.12г.",null,null,null,null,null,null,1,"ведущий инженер по общестроительным работам ООО \"РусВинил\"","Докторов И.М.","приказ №175-ос от 20.09.2012 г."]
[null,null,null,"(наименование, номер и дата выдачи свидетельства о государственной регистрации, ОГРН, ИНН, почтовые реквизиты, телефон/факс - для юридических лиц)",null,null,null,null,null,null,null,null,null,null,null,null,null,null,null,null,null,null,null,2,"ведущий инженер по общестроительным работам ООО \"РусВинил\"","Докторов И.М.","приказ №175-ос от 20.09.2012 г.",null,null,null,null,null,null,2,"Инженер по подземным трубопроводам ООО \"РусВинил\"","Рахмангулов В.Г.","приказ №224-ос от 27.11.2012г."]
[null,null,null,"Лицо, осуществляющее подготовку проектной документации:",null,null,null,null,null,null,null,null,null,null,null,null,null,null,null,null,null,null,null,3,"ведущий инженер по общестроительным работам ООО \"РусВинил\"","Докторов И.М.","приказ №175-ос от 20.09.2012 г.",null,null,null,null,null,null,3,"инженер по общестроительным работам ООО \"РусВинил\"","Милованов Н.С.","приказ №33/1-ОС от 27.02.2013 г."]
[null,null,null,"ЗАО «Текнип Рус», Свидетельство о гос. регистрации серия 78 №008218175 от 11.04.2011 г., ОГРН 1027810258882, ИНН 7810913731, 196084, г. Санкт-Петербург, Лиговский проспект, д. 264, корпус А, тел. +7(812)495-48-70.",null,null,null,null,null,null,null,null,null,null,null,null,null,null,null,null,null,null,null,4.8,"ведущий инженер по общестроительным работам ООО \"РусВинил\"","Докторов И.М.","приказ №175-ос от 20.09.2012 г.",null,null,null,null,null,null,4.8,"ведущий инженер по общестроительным работам ООО \"РусВинил\"","Докторов И.М.","приказ №175-ос от 20.09.2012 г."]
[null,null,null,"(наименование, номер и дата выдачи свидетельства о государственной регистрации, ОГРН, ИНН, почтовые реквизиты, телефон/факс - для юридических лиц)",null,null,null,null,null,null,null,null,null,null,null,null,null,null,null,null,null,null,null,5,"ведущий инженер по общестроительным работам ООО \"РусВинил\"","Докторов И.М.","приказ №175-ос от 20.09.2012 г.",null,null,null,null,null,null,5,"Инженер по подземным трубопроводам ООО \"РусВинил\"","Рахмангулов В.Г.","приказ №224-ос от 27.11.2012г."]
[null,null,null,"Лицо, осуществляющее строительство, выполнившее работы по разбивке осей объекта капитального строительства на местности:",null,null,null,null,null,null,null,null,null,null,null,null,null,null,null,null,null,null,null,6,"ведущий инженер по общестроительным работам ООО \"РусВинил\"","Докторов И.М.","приказ №175-ос от 20.09.2012 г.",null,null,null,null,null,null,6,"ведущий инженер по общестроительным работам ООО \"РусВинил\"","Докторов И.М.","приказ №175-ос от 20.09.2012 г."]
[null,null,null,"ЗАО «Ренейссанс Констракшн». Свидетельство о гос. регистрации серия 77 №00540119 от 15.10.2002 г., ОГРН 1027739384309, ИНН 7708185129, 107078, г. Москва, Орликов переулок, д. 6, тел. +7(495)787-59-20, факс +7(495)365-366.",null,null,null,null,null,null,null,null,null,null,null,null,null,null,null,null,null,null,null,7,"ведущий инженер по общестроительным работам ООО \"РусВинил\"","Докторов И.М.","приказ №175-ос от 20.09.2012 г.",null,null,null,null,null,null,7,"Инженер по подземным трубопроводам ООО \"РусВинил\"","Рахмангулов В.Г.","приказ №224-ос от 27.11.2012г."]
[null,null,null,"(наименование, номер и дата выдачи свидетельства о государственной регистрации, ОГРН, ИНН, почтовые реквизиты, телефон/факс - для юридических лиц)",null,null,null,null,null,null,null,null,null,null,null,null,null,null,null,null,null,null,null,8,"ведущий инженер по общестроительным работам ООО \"РусВинил\"","Докторов И.М.","приказ №175-ос от 20.09.2012 г.",null,null,null,null,null,null,8,"Инженер по подземным трубопроводам ООО \"РусВинил\"","Рахмангулов В.Г.","приказ №224-ос от 27.11.2012г."]
[null,null,null,null,null,null,null,null,null,null,null,null,null,null,null,null,null,null,null,null,null,null,null,9,"ведущий инженер по общестроительным работам ООО \"РусВинил\"","Докторов И.М.","приказ №175-ос от 20.09.2012 г.",null,null,null,null,null,null,9,"Инженер по подземным трубопроводам ООО \"РусВинил\"","Рахмангулов В.Г.","приказ №224-ос от 27.11.2012г."]
[null,null,null,"АКТ\nразбивки осей объекта капитального строительства на местности",null,null,null,null,null,null,null,null,null,null,null,null,null,null,null,null,null,null,null,8.4,"ведущий инженер по общестроительным работам ООО \"РусВинил\"","Докторов И.М.","приказ №175-ос от 20.09.2012 г.",null,null,null,null,null,null,8.4,"ведущий инженер по общестроительным работам ООО \"РусВинил\"","Докторов И.М.","приказ №175-ос от 20.09.2012 г."]
[null,null,null,null,null,null,null,null,null,null,null,null,null,null,null,null,null,null,null,null,null,null,null,4,"ведущий инженер по общестроительным работам ООО \"РусВинил\"","Докторов И.М.","приказ №175-ос от 20.09.2012 г.",null,null,null,null,null,null,4,"ведущий инженер по общестроительным работам ООО \"РусВинил\"","Докторов И.М.","приказ №175-ос от 20.09.2012 г."]
[null,null,null,{"$f":"B4","v":"№RENUUO-1410-ZONE8-DOP-1"},null,null,null,null,null,null,null,null,{"$f":"B5","v":"2013-10-01"},null,null,null,null,null,null,null,null,null,null,6.7,"ведущий инженер по общестроительным работам ООО \"РусВинил\"","Докторов И.М.","приказ №175-ос от 20.09.2012 г.",null,null,null,null,null,null,6.7,"Инженер по подземным трубопроводам ООО \"РусВинил\"","Рахмангулов В.Г.","приказ №224-ос от 27.11.2012г."]
[null,null,null,null,null,null,null,null,null,null,null,null,null,null,null,null,null,null,null,null,null,null,null,2.6,"ведущий инженер по общестроительным работам ООО \"РусВинил\"","Докторов И.М.","приказ №175-ос от 20.09.2012 г.",null,null,null,null,null,null,2.6,"инженер по подземным трубопроводам ООО \"РусВинил\"","Рахмангулов В.Г.","приказ №224-ос от 27.11.2012г."]
{"$rows_left_out":61}
{"sheet":"ACT LOG","index":1,"n_rows":120,"n_cols":16,"rows_kept":120,"cut":false,"hidden":false,"merged":[]}
[" ","S/N","ACT CODE","ACT TYPE","ZONE","AKT NO","AKT DATE","ITEM DEFINITION (строительство которому выполняется разбивка)","WORK ITEM (наименование объекта строительства)","Координаты и оси\n(N=288.600, E=204.700)\nв осях 1-3/A-B","Отметки","Дополнительные сведения","2. Разбивка произведена по данным:","Нормативные акты","Приложения","Проблемы"]
["; ","0","1","2","3","4","5","6","7","8","9","10","11","12","13","14"]
[null,1,null,"АРО",2.6,"11-1/1","2013-08-01","колодцев","CW-RCB-625B (N=129.700, E=422.000), CW-RCB-625A(618A) (N=137.200, E=422.000)",null,null,null,"проект ЗАО \"Текнип Рус\" 5235А-020-000-ГТ-035 (9631U-M-DW-1452-2035 Rev.2), 5235А-060-000-ГТ-014 (9631U-U-DW-1452-6014 Rev.4)",{"$f":"CONCATENATE(Table1[[#This Row],[11]],\", СНиП 3.01.03-84.\")","v":"проект ЗАО \"Текнип Рус\" 5235А-020-000-ГТ-035 (9631U-M-DW-1452-2035 Rev.2), 5235А-060-000-ГТ-014 (9631U-U-DW-1452-6014 Rev.4), СНиП 3.01.03-84."},"исполнительная схема разбивки осей колодцев CW-RCB-625B, CW-RCB-625A(618A) №RENUUO-SR-1410-ZONE2,6-11-1/1"]
[null,2,null,"АРО",2.6,"11-2/1","2013-08-01","колодцев","CW-RCB-624B (N=129.700, E=382.000), CW-RCB-624A(619A) (N=137.300, E=382.000)",null,null,null,"проект ЗАО \"Текнип Рус\" 5235А-020-000-ГТ-034 (9631U-M-DW-1452-2034 Rev.5), 5235А-060-000-ГТ-014 (9631U-U-DW-1452-6014 Rev.4)",{"$f":"CONCATENATE(Table1[[#This Row],[11]],\", СНиП 3.01.03-84.\")","v":"проект ЗАО \"Текнип Рус\" 5235А-020-000-ГТ-034 (9631U-M-DW-1452-2034 Rev.5), 5235А-060-000-ГТ-014 (9631U-U-DW-1452-6014 Rev.4), СНиП 3.01.03-84."},"исполнительная схема разбивки осей колодцев CW-RCB-624B, CW-RCB-624A(619A) №RENUUO-SR-1410-ZONE2,6-11-2/1"]
[null,3,null,"АРО",2.6,"11-3/1","2013-04-17","колодцев","CW-RCB-622B (E=342.000, N=130.700), CW-RCB-622A (623A) (E=342.000, N=137.300)",null,null,null,"проект ЗАО \"Текнип Рус\" 5235А-020-000-ГТ-034 (9631U-M-DW-1452-2034 Rev.5), 5235А-060-000-ГТ-014 (9631U-U-DW-1452-6014 Rev.4)",{"$f":"CONCATENATE(Table1[[#This Row],[11]],\", СНиП 3.01.03-84.\")","v":"проект ЗАО \"Текнип Рус\" 5235А-020-000-ГТ-034 (9631U-M-DW-1452-2034 Rev.5), 5235А-060-000-ГТ-014 (9631U-U-DW-1452-6014 Rev.4), СНиП 3.01.03-84."},"исполнительная схема разбивки осей колодцев CW-RCB-622B, CW-RCB-622A(623A) №RENUUO-SR-1410-ZONE2,6-11-3/1"]
[null,4,null,"АРО",2.6,"11-4/1","2013-04-17","колодцев","CW-RCB-620B (N=130.700, E=309.000), CW-RCB-620A(624A) (N=137.300, E=309.000)",null,null,null,"проект ЗАО \"Текнип Рус\" 5235А-020-000-ГТ-034 (9631U-M-DW-1452-2034 Rev.5), 5235А-060-000-ГТ-014 (9631U-U-DW-1452-6014 Rev.4), 5235А-060-000-ГТ-011 (9631U-U-DW-1452-6011 Rev.4)",{"$f":"CONCATENATE(Table1[[#This Row],[11]],\", СНиП 3.01.03-84.\")","v":"проект ЗАО \"Текнип Рус\" 5235А-020-000-ГТ-034 (9631U-M-DW-1452-2034 Rev.5), 5235А-060-000-ГТ-014 (9631U-U-DW-1452-6014 Rev.4), 5235А-060-000-ГТ-011 (9631U-U-DW-1452-6011 Rev.4), СНиП 3.01.03-84."},"исполнительная схема разбивки осей колодцев CW-RCB-620B, CW-RCB-620A(624A) №RENUUO-SR-1410-ZONE2,6-11-4/1"]
[null,5,null,"АРО",2.6,"11-5/1","2013-08-18","колодцев","CW-RCB-265B (N=137.300, E=225.750), CW-RCB-265A (278A) (N=130.700, E=225.750)",null,null,null,"проект ЗАО \"Текнип Рус\" 5235А-020-000-ГТ-032 (9631U-M-DW-1452-2032 Rev.4), 5235А-060-000-ГТ-005 (9631U-U-DW-1452-6005 Rev.3)",{"$f":"CONCATENATE(Table1[[#This Row],[11]],\", СНиП 3.01.03-84.\")","v":"проект ЗАО \"Текнип Рус\" 5235А-020-000-ГТ-032 (9631U-M-DW-1452-2032 Rev.4), 5235А-060-000-ГТ-005 (9631U-U-DW-1452-6005 Rev.3), СНиП 3.01.03-84."},"исполнительная схема разбивки осей колодцев CW-RCB-265B, CW-RCB-265A (278A) №RENUUO-SR-1410-ZONE2,6-11-5/1"]
[null,6,null,"АРО",2.6,"11-6/1","2013-08-18","колодцев","CW-RCB-266B (N=137.300, E=265.000), CW-RCB-266A(276A) (N=130.700, E=265.000)",null,null,null,"проект ЗАО \"Текнип Рус\" 5235А-020-000-ГТ-032 (9631U-M-DW-1452-2032 Rev.4), 5235А-060-000-ГТ-009 (9631U-U-DW-1452-6009 Rev.4)",{"$f":"CONCATENATE(Table1[[#This Row],[11]],\", СНиП 3.01.03-84.\")","v":"проект ЗАО \"Текнип Рус\" 5235А-020-000-ГТ-032 (9631U-M-DW-1452-2032 Rev.4), 5235А-060-000-ГТ-009 (9631U-U-DW-1452-6009 Rev.4), СНиП 3.01.03-84."},"исполнительная схема разбивки осей колодцев CW-RCB-265B, CW-RCB-266A (276A) №RENUUO-SR-1410-ZONE2,6-11-6/1"]
[null,7,null,"АРО",6.7,"16-4/1","2013-09-17","колодцев ","CW-RCB-703B (N=291.500, E=173.700), CW-RCB-703A (N=291.500, E=180.300)",null,null,null,"проект ЗАО \"Текнип Рус\" 5235А-060-000-ГТ-016 (9631U-U-DW-1452-6016 Rev.3), 5235А-070-000-ГТ-004 (9631U-U-DW-1452-7004 Rev.4)",{"$f":"CONCATENATE(Table1[[#This Row],[11]],\", СНиП 3.01.03-84.\")","v":"проект ЗАО \"Текнип Рус\" 5235А-060-000-ГТ-016 (9631U-U-DW-1452-6016 Rev.3), 5235А-070-000-ГТ-004 (9631U-U-DW-1452-7004 Rev.4), СНиП 3.01.03-84."},"испольнительная схема разбивки осей колодцев  CW-RCB-703B, CW-RCB-703A №RENUUO-SR-1410-ZONE6,7-16-4/1"]
[null,8,null,"АРО",6,"16-6/1","2013-07-08","колодцев ","CW-RCB-813A (E=173.700, N=346.000), CW-RCB-813B (E=180.300, N=346.000)",null,null,null,"проект ЗАО \"Текнип Рус\" 5235А-060-000-ГТ-017 (9631U-U-DW-1452-6017 Rev.3)",{"$f":"CONCATENATE(Table1[[#This Row],[11]],\", СНиП 3.01.03-84.\")","v":"проект ЗАО \"Текнип Рус\" 5235А-060-000-ГТ-017 (9631U-U-DW-1452-6017 Rev.3), СНиП 3.01.03-84."},"испольнительная схема разбивки осей колодцев  CW-RCB-813A, CW-RCB-813B  №RENUUO-SR-1410-ZONE6-16-6/1"]
[null,9,null,"АРО",3,"16-12/1","2013-07-24","колодцев ","CW-RCB-340A (N=460.890, E=174.200), CW-RCB-340B (N=460.890, E=180.300) ",null,null,null,"проект ЗАО \"Текнип Рус\" 5235А-030-000-ГТ-003 (9631U-V-DW-1452-3003 Rev.3)",{"$f":"CONCATENATE(Table1[[#This Row],[11]],\", СНиП 3.01.03-84.\")","v":"проект ЗАО \"Текнип Рус\" 5235А-030-000-ГТ-003 (9631U-V-DW-1452-3003 Rev.3), СНиП 3.01.03-84."},"испольнительная схема разбивки осей колодцев  CW-RCB-340A, CW-RCB-340B  №RENUUO-SR-1410-ZONE3-16-12/1"]
[null,10,null,"АРО",3,"16-14/1","2013-07-08","колодцев ","CW-RCB-342A (N=379.750, E=180.300), CW-RCB-342B (N=379.750, E=174.200) ",null,null,null,"проект ЗАО \"Текнип Рус\" 5235А-030-000-ГТ-014 (9631U-V-DW-1452-3014 Rev.3)",{"$f":"CONCATENATE(Table1[[#This Row],[11]],\", СНиП 3.01.03-84.\")","v":"проект ЗАО \"Текнип Рус\" 5235А-030-000-ГТ-014 (9631U-V-DW-1452-3014 Rev.3), СНиП 3.01.03-84."},"испольнительная схема разбивки осей колодцев  CW-RCB-342A, CW-RCB-342B  №RENUUO-SR-1410-ZONE3-16-14/1"]
[null,11,null,"АРО",3,"16-13/1","2013-07-08","колодцев ","CW-RCB-341A (N=422.480, E=180.300), CW-RCB-341B (N=422.480, E=174.200) ",null,null,null,"проект ЗАО \"Текнип Рус\" 5235А-030-000-ГТ-014 (9631U-V-DW-1452-3014 Rev.4)",{"$f":"CONCATENATE(Table1[[#This Row],[11]],\", СНиП 3.01.03-84.\")","v":"проект ЗАО \"Текнип Рус\" 5235А-030-000-ГТ-014 (9631U-V-DW-1452-3014 Rev.4), СНиП 3.01.03-84."},"испольнительная схема разбивки осей колодцев  CW-RCB-341A, CW-RCB-341B  №RENUUO-SR-1410-ZONE3-16-13/1"]
[null,12,null,"АРО",6.7,"16-5/1","2013-07-15","колодцев ","CW-RCB-705B (N=248.500, E=173.700), CW-RCB-705A (N=248.500, E=180.300)",null,null,null,"проект ЗАО \"Текнип Рус\" 5235А-070-000-ГТ-004 (9631U-U-DW-1452-7004 Rev.4), 5235А-060-000-ГТ-016 (9631U-U-DW-1452-6016 Rev.3)",{"$f":"CONCATENATE(Table1[[#This Row],[11]],\", СНиП 3.01.03-84.\")","v":"проект ЗАО \"Текнип Рус\" 5235А-070-000-ГТ-004 (9631U-U-DW-1452-7004 Rev.4), 5235А-060-000-ГТ-016 (9631U-U-DW-1452-6016 Rev.3), СНиП 3.01.03-84."},"испольнительная схема разбивки осей колодцев  CW-RCB-705B, CW-RCB-705A №RENUUO-SR-1410-ZONE6,7-16-5/1"]
[null,13,null,"АРО",6.7,"16-3/1","2013-07-15","колодцев ","CW-RCB-707B (N=214.000, E=173.700), CW-RCB-707A (N=214.000, E=180.300)",null,null,null,"проект ЗАО \"Текнип Рус\" 5235А-070-000-ГТ-004 (9631U-U-DW-1452-7004 Rev.4), 5235А-060-000-ГТ-016 (9631U-U-DW-1452-6016 Rev.3)",{"$f":"CONCATENATE(Table1[[#This Row],[11]],\", СНиП 3.01.03-84.\")","v":"проект ЗАО \"Текнип Рус\" 5235А-070-000-ГТ-004 (9631U-U-DW-1452-7004 Rev.4), 5235А-060-000-ГТ-016 (9631U-U-DW-1452-6016 Rev.3), СНиП 3.01.03-84."},"испольнительная схема разбивки осей колодцев  CW-RCB-707B, CW-RCB-707A №RENUUO-SR-1410-ZONE6,7-16-3/1"]
[null,14,null,"АРО",6.7,"16-2/1","2013-07-15","колодцев ","CW-RCB-719A (N=164.050, E=173.700), CW-RCB-724A (N=164.056, E=180.300)",null,null,null,"проект ЗАО \"Текнип Рус\" 5235А-070-000-ГТ-006 (9631U-U-DW-1452-7006 Rev.4), 5235А-060-000-ГТ-015 (9631U-U-DW-1452-6015 Rev.4)",{"$f":"CONCATENATE(Table1[[#This Row],[11]],\", СНиП 3.01.03-84.\")","v":"проект ЗАО \"Текнип Рус\" 5235А-070-000-ГТ-006 (9631U-U-DW-1452-7006 Rev.4), 5235А-060-000-ГТ-015 (9631U-U-DW-1452-6015 Rev.4), СНиП 3.01.03-84."},"испольнительная схема разбивки осей колодцев  CW-RCB-719A, CW-RCB-724A №RENUUO-SR-1410-ZONE6,7-16-2/1"]
[null,15,null,"АРО",1,"6-1/1","2013-08-09","колодцев","CW-RCB-154B (N=445.500, E=576.200), CW-RCB-154A(054A) (N=445.500, E=571.450)",null,null,null,"проект ЗАО \"Текнип Рус\" 5235А-010-000-ГТ-016 (9631U-V-DW-1452-1016 Rev.3), 5235А-010-000-ГТ-017 (9631U-V-DW-1452-1017 Rev.4)",{"$f":"CONCATENATE(Table1[[#This Row],[11]],\", СНиП 3.01.03-84.\")","v":"проект ЗАО \"Текнип Рус\" 5235А-010-000-ГТ-016 (9631U-V-DW-1452-1016 Rev.3), 5235А-010-000-ГТ-017 (9631U-V-DW-1452-1017 Rev.4), СНиП 3.01.03-84."},"исполнительная схема разбивки осей колодцев CW-RCB-154B, CW-RCB-154A(054A) №RENUUO-SR-1410-ZONE1-6-1/1"]
[null,16,null,"АРО",1,"6-2/1","2013-08-09","колодцев","CW-RCB-156A (N=404.500, E=571.650), CW-RCB-156B (N=404.500, E=576.200)",null,null,null,"проект ЗАО \"Текнип Рус\" 5235А-010-000-ГТ-020 (9631U-V-DW-1452-1020 Rev.3), 5235А-010-000-ГТ-019 (9631U-V-DW-1452-1019 Rev.5)",{"$f":"CONCATENATE(Table1[[#This Row],[11]],\", СНиП 3.01.03-84.\")","v":"проект ЗАО \"Текнип Рус\" 5235А-010-000-ГТ-020 (9631U-V-DW-1452-1020 Rev.3), 5235А-010-000-ГТ-019 (9631U-V-DW-1452-1019 Rev.5), СНиП 3.01.03-84."},"исполнительная схема разбивки осей колодцев CW-RCB-154B, CW-RCB-154A №RENUUO-SR-1410-ZONE1-6-2/1"]
[null,17,null,"АРО",1,"6-3/1","2013-10-16","колодца","CW-RCB-157A","(N=404.500, E=598.622)",null,null,"проект ЗАО \"Текнип Рус\" 5235А-010-000-ГТ-020 (9631U-V-DW-1452-1020 Rev.3)",{"$f":"CONCATENATE(Table1[[#This Row],[11]],\", СНиП 3.01.03-84.\")","v":"проект ЗАО \"Текнип Рус\" 5235А-010-000-ГТ-020 (9631U-V-DW-1452-1020 Rev.3), СНиП 3.01.03-84."},"исполнительная схема разбивки осей колодца CW-RCB-157A №RENUUO-SR-1410-ZONE1-6-3/1"]
[null,18,null,"АРО",3,"17-5/1","2013-10-19","колодца","CW-RCB-327A","(N=368.600, E=399.450)",null,null,"проект ЗАО \"Текнип Рус\" 5235А-030-000-ГТ-023 (9631U-V-DW-1452-3023 Rev.3)",{"$f":"CONCATENATE(Table1[[#This Row],[11]],\", СНиП 3.01.03-84.\")","v":"проект ЗАО \"Текнип Рус\" 5235А-030-000-ГТ-023 (9631U-V-DW-1452-3023 Rev.3), СНиП 3.01.03-84."},"исполнительная схема разбивка осей колодца CW-RCB-327A № RENUUO-SR-1410-ZONE3-17-5/1"]
{"$rows_left_out":100}